Target
Acyl-CoA:cholesterol acyltransferase
Ligand
BDBM50005979
Substrate
Meas. Tech.
ChEBML_28336
IC50
43±n/a nM
Citation
 Roark, WHRoth, BDHolmes, ATrivedi, BKKieft, KAEssenburg, ADKrause, BRStanfield, RL Inhibitors of acyl-CoA:cholesterol acyltransferase (ACAT). 2. Modification of fatty acid anilide ACAT inhibitors: bioisosteric replacement of the amide bond. J Med Chem 36:1662-8 (1993)  
Target
Name:
Acyl-CoA:cholesterol acyltransferase
Synonyms:
ACAT
Type:
Mol. Mass.:
35405.31
Organism:
Oryctolagus cuniculus
Description:
Residue:
305
  
Inhibitor
Name:
BDBM50005979
Synonyms:
CHEMBL46510 | Octadec-9-enoic acid (2,6-dimethyl-phenyl)-amide
Type:
Small organic molecule
Emp. Form.:
C26H43NO
Mol. Mass.:
385.6257
SMILES:
CCCCCCCC\C=C/CCCCCCCC(=O)Nc1c(C)cccc1C
: