Target
Acyl-CoA:cholesterol acyltransferase
Ligand
BDBM50047633
Substrate
Meas. Tech.
ChEBML_28336
IC50
1100±n/a nM
Citation
 Roark, WHRoth, BDHolmes, ATrivedi, BKKieft, KAEssenburg, ADKrause, BRStanfield, RL Inhibitors of acyl-CoA:cholesterol acyltransferase (ACAT). 2. Modification of fatty acid anilide ACAT inhibitors: bioisosteric replacement of the amide bond. J Med Chem 36:1662-8 (1993)  
Target
Name:
Acyl-CoA:cholesterol acyltransferase
Synonyms:
ACAT
Type:
Mol. Mass.:
35405.31
Organism:
Oryctolagus cuniculus
Description:
Residue:
305
  
Inhibitor
Name:
BDBM50047633
Synonyms:
1-(2-Chloro-6-methyl-phenyl)-3-octadecyl-urea | CHEMBL47522
Type:
Small organic molecule
Emp. Form.:
C26H45ClN2O
Mol. Mass.:
437.101
SMILES:
(=O)Nc1c(C)cccc1Cl
: