Target
Acyl-CoA:cholesterol acyltransferase
Ligand
BDBM50047645
Substrate
Meas. Tech.
ChEBML_28336
IC50
610±n/a nM
Citation
 Roark, WHRoth, BDHolmes, ATrivedi, BKKieft, KAEssenburg, ADKrause, BRStanfield, RL Inhibitors of acyl-CoA:cholesterol acyltransferase (ACAT). 2. Modification of fatty acid anilide ACAT inhibitors: bioisosteric replacement of the amide bond. J Med Chem 36:1662-8 (1993)  
Target
Name:
Acyl-CoA:cholesterol acyltransferase
Synonyms:
ACAT
Type:
Mol. Mass.:
35405.31
Organism:
Oryctolagus cuniculus
Description:
Residue:
305
  
Inhibitor
Name:
BDBM50047645
Synonyms:
1-(2,6-Dimethyl-phenyl)-3-octadecyl-urea | CHEMBL298465
Type:
Small organic molecule
Emp. Form.:
C27H48N2O
Mol. Mass.:
416.6828
SMILES:
(=O)Nc1c(C)cccc1C
: