Target
Acyl-CoA:cholesterol acyltransferase
Ligand
BDBM50047650
Substrate
Meas. Tech.
ChEBML_28336
IC50
860±n/a nM
Citation
 Roark, WHRoth, BDHolmes, ATrivedi, BKKieft, KAEssenburg, ADKrause, BRStanfield, RL Inhibitors of acyl-CoA:cholesterol acyltransferase (ACAT). 2. Modification of fatty acid anilide ACAT inhibitors: bioisosteric replacement of the amide bond. J Med Chem 36:1662-8 (1993)  
Target
Name:
Acyl-CoA:cholesterol acyltransferase
Synonyms:
ACAT
Type:
Mol. Mass.:
35405.31
Organism:
Oryctolagus cuniculus
Description:
Residue:
305
  
Inhibitor
Name:
BDBM50047650
Synonyms:
(2,4,6-Trimethoxy-phenyl)-carbamic acid octadec-9-enyl ester | CHEMBL44331
Type:
Small organic molecule
Emp. Form.:
C28H47NO5
Mol. Mass.:
477.6765
SMILES:
CCCCCCCC\C=C/CCCCCCCCOC(=O)Nc1c(OC)cc(OC)cc1OC
: