Target
Acyl-CoA:cholesterol acyltransferase
Ligand
BDBM50047631
Substrate
Meas. Tech.
ChEBML_28336
IC50
3100±n/a nM
Citation
 Roark, WHRoth, BDHolmes, ATrivedi, BKKieft, KAEssenburg, ADKrause, BRStanfield, RL Inhibitors of acyl-CoA:cholesterol acyltransferase (ACAT). 2. Modification of fatty acid anilide ACAT inhibitors: bioisosteric replacement of the amide bond. J Med Chem 36:1662-8 (1993)  
Target
Name:
Acyl-CoA:cholesterol acyltransferase
Synonyms:
ACAT
Type:
Mol. Mass.:
35405.31
Organism:
Oryctolagus cuniculus
Description:
Residue:
305
  
Inhibitor
Name:
BDBM50047631
Synonyms:
CHEMBL415924 | Octadecyl-carbamic acid 2,6-dimethyl-phenyl ester
Type:
Small organic molecule
Emp. Form.:
C27H47NO2
Mol. Mass.:
417.6676
SMILES:
(=O)Oc1c(C)cccc1C
: