Target
Acyl-CoA:cholesterol acyltransferase
Ligand
BDBM50047640
Substrate
Meas. Tech.
ChEBML_28336
IC50
52±n/a nM
Citation
 Roark, WHRoth, BDHolmes, ATrivedi, BKKieft, KAEssenburg, ADKrause, BRStanfield, RL Inhibitors of acyl-CoA:cholesterol acyltransferase (ACAT). 2. Modification of fatty acid anilide ACAT inhibitors: bioisosteric replacement of the amide bond. J Med Chem 36:1662-8 (1993)  
Target
Name:
Acyl-CoA:cholesterol acyltransferase
Synonyms:
ACAT
Type:
Mol. Mass.:
35405.31
Organism:
Oryctolagus cuniculus
Description:
Residue:
305
  
Inhibitor
Name:
BDBM50047640
Synonyms:
1-(2,6-Diethyl-phenyl)-3-(1,1-dimethyl-undecyl)-urea | CHEMBL42897
Type:
Small organic molecule
Emp. Form.:
C24H42N2O
Mol. Mass.:
374.6031
SMILES:
CCCCCCCCCCC(C)(C)NC(=O)Nc1c(CC)cccc1CC
: