Target
Acyl-CoA:cholesterol acyltransferase
Ligand
BDBM50047646
Substrate
Meas. Tech.
ChEBML_28336
IC50
250±n/a nM
Citation
 Roark, WHRoth, BDHolmes, ATrivedi, BKKieft, KAEssenburg, ADKrause, BRStanfield, RL Inhibitors of acyl-CoA:cholesterol acyltransferase (ACAT). 2. Modification of fatty acid anilide ACAT inhibitors: bioisosteric replacement of the amide bond. J Med Chem 36:1662-8 (1993)  
Target
Name:
Acyl-CoA:cholesterol acyltransferase
Synonyms:
ACAT
Type:
Mol. Mass.:
35405.31
Organism:
Oryctolagus cuniculus
Description:
Residue:
305
  
Inhibitor
Name:
BDBM50047646
Synonyms:
1-Tetradecyl-3-(2,4,6-trifluoro-phenyl)-urea | CHEMBL44334
Type:
Small organic molecule
Emp. Form.:
C21H33F3N2O
Mol. Mass.:
386.4947
SMILES:
CCCCCCCCCCCCCCNC(=O)Nc1c(F)cc(F)cc1F
: