Target
Acyl-CoA:cholesterol acyltransferase
Ligand
BDBM50047609
Substrate
Meas. Tech.
ChEBML_28336
IC50
4500±n/a nM
Citation
 Roark, WHRoth, BDHolmes, ATrivedi, BKKieft, KAEssenburg, ADKrause, BRStanfield, RL Inhibitors of acyl-CoA:cholesterol acyltransferase (ACAT). 2. Modification of fatty acid anilide ACAT inhibitors: bioisosteric replacement of the amide bond. J Med Chem 36:1662-8 (1993)  
Target
Name:
Acyl-CoA:cholesterol acyltransferase
Synonyms:
ACAT
Type:
Mol. Mass.:
35405.31
Organism:
Oryctolagus cuniculus
Description:
Residue:
305
  
Inhibitor
Name:
BDBM50047609
Synonyms:
1-(2,5-Dimethyl-phenyl)-3-octadec-9-enyl-urea | CHEMBL46966
Type:
Small organic molecule
Emp. Form.:
C27H46N2O
Mol. Mass.:
414.6669
SMILES:
CCCCCCCC\C=C/CCCCCCCCNC(=O)Nc1cc(C)ccc1C
: