Target
Acyl-CoA:cholesterol acyltransferase
Ligand
BDBM50047641
Substrate
Meas. Tech.
ChEBML_28336
IC50
>5000±n/a nM
Citation
 Roark, WHRoth, BDHolmes, ATrivedi, BKKieft, KAEssenburg, ADKrause, BRStanfield, RL Inhibitors of acyl-CoA:cholesterol acyltransferase (ACAT). 2. Modification of fatty acid anilide ACAT inhibitors: bioisosteric replacement of the amide bond. J Med Chem 36:1662-8 (1993)  
Target
Name:
Acyl-CoA:cholesterol acyltransferase
Synonyms:
ACAT
Type:
Mol. Mass.:
35405.31
Organism:
Oryctolagus cuniculus
Description:
Residue:
305
  
Inhibitor
Name:
BDBM50047641
Synonyms:
1-Octadec-9-enyl-3-(4-phenoxy-phenyl)-urea | CHEMBL47099
Type:
Small organic molecule
Emp. Form.:
C31H46N2O2
Mol. Mass.:
478.7091
SMILES:
CCCCCCCC\C=C/CCCCCCCCNC(=O)Nc1ccc(Oc2ccccc2)cc1
: