Target
Acyl-CoA:cholesterol acyltransferase
Ligand
BDBM50047664
Substrate
Meas. Tech.
ChEBML_28336
IC50
690±n/a nM
Citation
 Roark, WHRoth, BDHolmes, ATrivedi, BKKieft, KAEssenburg, ADKrause, BRStanfield, RL Inhibitors of acyl-CoA:cholesterol acyltransferase (ACAT). 2. Modification of fatty acid anilide ACAT inhibitors: bioisosteric replacement of the amide bond. J Med Chem 36:1662-8 (1993)  
Target
Name:
Acyl-CoA:cholesterol acyltransferase
Synonyms:
ACAT
Type:
Mol. Mass.:
35405.31
Organism:
Oryctolagus cuniculus
Description:
Residue:
305
  
Inhibitor
Name:
BDBM50047664
Synonyms:
CHEMBL46744 | Hexadecane-1-sulfonic acid (2,4,6-trimethoxy-phenyl)-amide
Type:
Small organic molecule
Emp. Form.:
C25H45NO5S
Mol. Mass.:
471.694
SMILES:
CCCCCCCCCCCCCCCCS(=O)(=O)Nc1c(OC)cc(OC)cc1OC
: