Target
Acyl-CoA:cholesterol acyltransferase
Ligand
BDBM50047627
Substrate
Meas. Tech.
ChEBML_28336
IC50
1200±n/a nM
Citation
 Roark, WHRoth, BDHolmes, ATrivedi, BKKieft, KAEssenburg, ADKrause, BRStanfield, RL Inhibitors of acyl-CoA:cholesterol acyltransferase (ACAT). 2. Modification of fatty acid anilide ACAT inhibitors: bioisosteric replacement of the amide bond. J Med Chem 36:1662-8 (1993)  
Target
Name:
Acyl-CoA:cholesterol acyltransferase
Synonyms:
ACAT
Type:
Mol. Mass.:
35405.31
Organism:
Oryctolagus cuniculus
Description:
Residue:
305
  
Inhibitor
Name:
BDBM50047627
Synonyms:
1-Octadec-9-enyl-3-(2,4,6-trichloro-phenyl)-urea | CHEMBL44885
Type:
Small organic molecule
Emp. Form.:
C25H39Cl3N2O
Mol. Mass.:
489.949
SMILES:
CCCCCCCC\C=C/CCCCCCCCNC(=O)Nc1c(Cl)cc(Cl)cc1Cl
: