Target
Acyl-CoA:cholesterol acyltransferase
Ligand
BDBM50047670
Substrate
Meas. Tech.
ChEBML_28336
IC50
340±n/a nM
Citation
 Roark, WHRoth, BDHolmes, ATrivedi, BKKieft, KAEssenburg, ADKrause, BRStanfield, RL Inhibitors of acyl-CoA:cholesterol acyltransferase (ACAT). 2. Modification of fatty acid anilide ACAT inhibitors: bioisosteric replacement of the amide bond. J Med Chem 36:1662-8 (1993)  
Target
Name:
Acyl-CoA:cholesterol acyltransferase
Synonyms:
ACAT
Type:
Mol. Mass.:
35405.31
Organism:
Oryctolagus cuniculus
Description:
Residue:
305
  
Inhibitor
Name:
BDBM50047670
Synonyms:
1-(2,4-Difluoro-phenyl)-3-tetradecyl-urea | CHEMBL47221
Type:
Small organic molecule
Emp. Form.:
C21H34F2N2O
Mol. Mass.:
368.5043
SMILES:
CCCCCCCCCCCCCCNC(=O)Nc1ccc(F)cc1F
: