Target
Acyl-CoA:cholesterol acyltransferase
Ligand
BDBM50047616
Substrate
Meas. Tech.
ChEBML_28336
IC50
47±n/a nM
Citation
 Roark, WHRoth, BDHolmes, ATrivedi, BKKieft, KAEssenburg, ADKrause, BRStanfield, RL Inhibitors of acyl-CoA:cholesterol acyltransferase (ACAT). 2. Modification of fatty acid anilide ACAT inhibitors: bioisosteric replacement of the amide bond. J Med Chem 36:1662-8 (1993)  
Target
Name:
Acyl-CoA:cholesterol acyltransferase
Synonyms:
ACAT
Type:
Mol. Mass.:
35405.31
Organism:
Oryctolagus cuniculus
Description:
Residue:
305
  
Inhibitor
Name:
BDBM50047616
Synonyms:
1-(2,6-Diisopropyl-phenyl)-3-(2,2-dimethyl-dodecyl)-urea | CHEMBL46481
Type:
Small organic molecule
Emp. Form.:
C27H48N2O
Mol. Mass.:
416.6828
SMILES:
CCCCCCCCCCC(C)(C)CNC(=O)Nc1c(cccc1C(C)C)C(C)C
: