Target
Acyl-CoA:cholesterol acyltransferase
Ligand
BDBM50047658
Substrate
Meas. Tech.
ChEBML_28336
IC50
900±n/a nM
Citation
 Roark, WHRoth, BDHolmes, ATrivedi, BKKieft, KAEssenburg, ADKrause, BRStanfield, RL Inhibitors of acyl-CoA:cholesterol acyltransferase (ACAT). 2. Modification of fatty acid anilide ACAT inhibitors: bioisosteric replacement of the amide bond. J Med Chem 36:1662-8 (1993)  
Target
Name:
Acyl-CoA:cholesterol acyltransferase
Synonyms:
ACAT
Type:
Mol. Mass.:
35405.31
Organism:
Oryctolagus cuniculus
Description:
Residue:
305
  
Inhibitor
Name:
BDBM50047658
Synonyms:
1-Octadecyl-3-(2,4,6-trimethoxy-phenyl)-urea | CHEMBL46985
Type:
Small organic molecule
Emp. Form.:
C28H50N2O4
Mol. Mass.:
478.7076
SMILES:
(=O)Nc1c(OC)cc(OC)cc1OC
: