Target
Beta-2 adrenergic receptor
Ligand
BDBM50019060
Substrate
Meas. Tech.
ChEBML_30208
Ki
1500±n/a nM
Citation
 Chen, GTKing, MGusovsky, FCreveling, CRDaly, JWChen, BHNie, JYKirk, KL Syntheses of 2,5- and 2,6-difluoronorepinephrine, 2,5-difluoroepinephrine, and 2,6-difluorophenylephrine: effect of disubstitution with fluorine on adrenergic activity. J Med Chem 36:3947-55 (1994)  
Target
Name:
Beta-2 adrenergic receptor
Synonyms:
ADRB2_RAT Adrb2r | Adrenergic receptor beta
Type:
PROTEIN
Mol. Mass.:
46896.26
Organism:
Rattus norvegicus
Description:
ChEMBL_38603
Residue:
418
  
Inhibitor
Name:
BDBM50019060
Synonyms:
(+/-)4-(2-Amino-1-hydroxy-ethyl)-3-fluoro-benzene-1,2-diol 4-(2-Amino-1-hydroxy-ethyl)-3-fluoro-benzene-1,2-diol(2-FNE) | CHEMBL287587
Type:
Small organic molecule
Emp. Form.:
C8H10FNO3
Mol. Mass.:
187.1683
SMILES:
NCC(O)c1ccc(O)c(O)c1F
: