Target
Alpha-1A/Alpha-1B/Alpha-1D adrenergic receptor
Ligand
BDBM50019059
Substrate
Meas. Tech.
ChEMBL_30083 (CHEMBL642863)
Ki
16500±n/a nM
Citation
 Chen, GTKing, MGusovsky, FCreveling, CRDaly, JWChen, BHNie, JYKirk, KL Syntheses of 2,5- and 2,6-difluoronorepinephrine, 2,5-difluoroepinephrine, and 2,6-difluorophenylephrine: effect of disubstitution with fluorine on adrenergic activity. J Med Chem 36:3947-55 (1994)  
Target
Name:
Alpha-1A/Alpha-1B/Alpha-1D adrenergic receptor
Synonyms:
Adrenergic receptor alpha-1 alpha-1 Adrenergic Receptor
Type:
Mol. Mass.:
Description:
ASSAY_ID of EBI is 303470
Components:
This complex has 3 components.
Component 1
Name:
Alpha-1B adrenergic receptor
Synonyms:
ADA1B_RAT Alpha 1B-adrenoceptor Alpha adrenergic receptor 1A and 1B Alpha-1Adrenoceptor Alpha-1B adrenoreceptor | adrenergic Alpha1B
Type:
G Protein-Coupled Receptor (GPCR)
Mol. Mass.:
56606.71
Organism:
Rattus norvegicus (rat)
Description:
Receptor binding assays were performed using rat cortical membranes.
Residue:
515
  
Component 2
Name:
Alpha-1A adrenergic receptor
Synonyms:
ADA1A_RAT Adra1c Alpha-1A adrenoceptor Alpha-1C adrenergic receptor | adrenergic Alpha1A
Type:
Protein
Mol. Mass.:
51620.15
Organism:
Rattus norvegicus (Rat)
Description:
P43140
Residue:
466
  
Component 3
Name:
Alpha-1D adrenergic receptor
Synonyms:
ADA1D_RAT Adra1d Alpha-1D adrenergic receptor | Serotonin 1a (5-HT1a) receptor/Adrenergic receptor alpha-1
Type:
Protein
Mol. Mass.:
59375.97
Organism:
Rattus norvegicus (Rat)
Description:
P23944
Residue:
561
  
Inhibitor
Name:
BDBM50019059
Synonyms:
(+/-)3-Fluoro-4-(1-hydroxy-2-methylamino-ethyl)-benzene-1,2-diol 3-Fluoro-4-(1-hydroxy-2-methylamino-ethyl)-benzene-1,2-diol(2-FEPI) | CHEMBL43711
Type:
Small organic molecule
Emp. Form.:
C9H12FNO3
Mol. Mass.:
201.1949
SMILES:
CNCC(O)c1ccc(O)c(O)c1F
: