Target
Beta-1 adrenergic receptor
Ligand
BDBM36024
Substrate
Meas. Tech.
ChEBML_30207
Ki
13000±n/a nM
Citation
 Chen, GTKing, MGusovsky, FCreveling, CRDaly, JWChen, BHNie, JYKirk, KL Syntheses of 2,5- and 2,6-difluoronorepinephrine, 2,5-difluoroepinephrine, and 2,6-difluorophenylephrine: effect of disubstitution with fluorine on adrenergic activity. J Med Chem 36:3947-55 (1994)  
Target
Name:
Beta-1 adrenergic receptor
Synonyms:
ADRB1R, B1AR Adrb1 Adrenergic receptor beta Beta-1 adrenoreceptor adrenergic Beta1,2
Type:
Protein
Mol. Mass.:
50486.84
Organism:
Rattus norvegicus (Rat)
Description:
P18090
Residue:
466
  
Inhibitor
Name:
BDBM36024
Synonyms:
(R)-(-)-phenylephrine Phenylephrine,(-)
Type:
Guest
Emp. Form.:
C9H14NO2
Mol. Mass.:
168.2124
SMILES:
C[NH2+]C[C@H](O)c1cccc(O)c1
: