Target
Beta-1 adrenergic receptor
Ligand
BDBM50042997
Substrate
Meas. Tech.
ChEBML_30207
Ki
>50000±n/a nM
Citation
 Chen, GTKing, MGusovsky, FCreveling, CRDaly, JWChen, BHNie, JYKirk, KL Syntheses of 2,5- and 2,6-difluoronorepinephrine, 2,5-difluoroepinephrine, and 2,6-difluorophenylephrine: effect of disubstitution with fluorine on adrenergic activity. J Med Chem 36:3947-55 (1994)  
Target
Name:
Beta-1 adrenergic receptor
Synonyms:
ADRB1R, B1AR Adrb1 Adrenergic receptor beta Beta-1 adrenoreceptor adrenergic Beta1,2
Type:
Protein
Mol. Mass.:
50486.84
Organism:
Rattus norvegicus (Rat)
Description:
P18090
Residue:
466
  
Inhibitor
Name:
BDBM50042997
Synonyms:
4-(2-Amino-1-hydroxy-ethyl)-3,5-difluoro-benzene-1,2-diol(2,6-DiFNE) | CHEMBL435802
Type:
Small organic molecule
Emp. Form.:
C8H9F2NO3
Mol. Mass.:
205.1588
SMILES:
NCC(O)c1c(F)cc(O)c(O)c1F
: