Target
Platelet-activating factor receptor
Ligand
BDBM50251276
Substrate
Meas. Tech.
ChEMBL_151700 (CHEMBL760449)
EC50
180±n/a nM
Citation
 Lamouri, AHeymans, FTavet, FDive, GBatt, JPBlavet, NBraquet, PGodfroid, JJ Design and modeling of new platelet-activating factor antagonists. 1. Synthesis and biological activity of 1,4-bis(3',4',5'-trimethoxybenzoyl)-2-[[(substituted carbonyl and carbamoyl)oxy]methyl]piperazines. J Med Chem 36:990-1000 (1993)  
Target
Name:
Platelet-activating factor receptor
Synonyms:
PAF-R PTAFR_CAVPO Platelet-activating factor receptor
Type:
Protein
Mol. Mass.:
39005.63
Organism:
Cavia porcellus
Description:
Residue:
342
  
Inhibitor
Name:
BDBM50251276
Synonyms:
BN 52021 GINKOLIDE B ginkgolide B
Type:
Small organic molecule
Emp. Form.:
C20H24O10
Mol. Mass.:
424.3986
SMILES:
C[C@@H]1C(=O)O[C@H]2[C@H](O)[C@@]34[C@H]5C[C@@H](C(C)(C)C)[C@@]33[C@@H](O)C(=O)O[C@H]3O[C@@]4(C(=O)O5)[C@@]12O
: