Target
Platelet-activating factor receptor
Ligand
BDBM50046978
Substrate
Meas. Tech.
ChEMBL_151700 (CHEMBL760449)
EC50
180±n/a nM
Citation
 Lamouri, AHeymans, FTavet, FDive, GBatt, JPBlavet, NBraquet, PGodfroid, JJ Design and modeling of new platelet-activating factor antagonists. 1. Synthesis and biological activity of 1,4-bis(3',4',5'-trimethoxybenzoyl)-2-[[(substituted carbonyl and carbamoyl)oxy]methyl]piperazines. J Med Chem 36:990-1000 (1993)  
Target
Name:
Platelet-activating factor receptor
Synonyms:
PAF-R PTAFR_CAVPO Platelet-activating factor receptor
Type:
Protein
Mol. Mass.:
39005.63
Organism:
Cavia porcellus
Description:
Residue:
342
  
Inhibitor
Name:
BDBM50046978
Synonyms:
(1,3-Dimethyl-butyl)-carbamic acid 1,4-bis-(3,4,5-trimethoxy-benzoyl)-piperazin-2-ylmethyl ester | CHEMBL269132
Type:
Small organic molecule
Emp. Form.:
C32H45N3O10
Mol. Mass.:
631.7138
SMILES:
COc1cc(cc(OC)c1OC)C(=O)N1CCN(C(COC(=O)NC(C)CC(C)C)C1)C(=O)c1cc(OC)c(OC)c(OC)c1
: