Target
Protein kinase C gamma type
Ligand
BDBM50043774
Substrate
Meas. Tech.
ChEMBL_161143 (CHEMBL767411)
IC50
50000±n/a nM
Citation
 Kashiwada, YHuang, LBallas, LMJiang, JBJanzen, WPLee, KH New hexahydroxybiphenyl derivatives as inhibitors of protein kinase C. J Med Chem 37:195-200 (1994)  
Target
Name:
Protein kinase C gamma type
Synonyms:
KPCG_HUMAN PKC-gamma PRKCG Protein kinase C gamma type Protein kinase C, gamma
Type:
Enzyme
Mol. Mass.:
78458.05
Organism:
Homo sapiens (Human)
Description:
The recombinant human PKC enzymes were produced using a baculovirus expression system in SF9 cells
Residue:
697
  
Inhibitor
Name:
BDBM50043774
Synonyms:
6,6'-Bis-methoxymethyl-biphenyl-2,3,4,2',3',4'-hexaol | CHEMBL59451
Type:
Small organic molecule
Emp. Form.:
C16H18O8
Mol. Mass.:
338.3093
SMILES:
COCc1cc(O)c(O)c(O)c1-c1c(O)c(O)c(O)cc1COC
: