Target
Substance-P receptor
Ligand
BDBM50030184
Substrate
Meas. Tech.
ChEMBL_205786 (CHEMBL812414)
IC50
14±n/a nM
Citation
 Hagiwara, DMiyake, HIgari, NKarino, MMaeda, YFujii, TMatsuo, M Studies on neurokinin antagonists. 4. Synthesis and structure-activity relationships of novel dipeptide substance P antagonists: N2-[(4R)-4-hydroxy-1-[(1-methyl-1H-indol-3-yl)carbonyl]-L-prolyl]-N- methyl-N-(phenylmethyl)-3-(2-naphthyl)-L-alaninamide and its related compounds. J Med Chem 37:2090-9 (1994)  
Target
Name:
Substance-P receptor
Synonyms:
NK1R_CAVPO Neurokinin NK1 TACR1
Type:
Enzyme Catalytic Domain
Mol. Mass.:
46261.42
Organism:
GUINEA PIG
Description:
Neurokinin NK1 TACR1 GUINEA PIG::P30547
Residue:
407
  
Inhibitor
Name:
BDBM50030184
Synonyms:
(R)-4-Hydroxy-1-(3-phenyl-propionyl)-pyrrolidine-2-carboxylic acid [(R)-1-(benzyl-methyl-carbamoyl)-2-phenyl-ethyl]-amide | CHEMBL63249
Type:
Small organic molecule
Emp. Form.:
C31H35N3O4
Mol. Mass.:
513.6273
SMILES:
CN(Cc1ccccc1)C(=O)[C@@H](Cc1ccccc1)NC(=O)C1C[C@@H](O)CN1C(=O)CCc1ccccc1
: