Target
Sodium-dependent dopamine transporter
Ligand
BDBM86702
Substrate
Meas. Tech.
ChEMBL_62490 (CHEMBL677547)
Ki
854±n/a nM
Citation
 Newman, AHAllen, ACIzenwasser, SKatz, JL Novel 3 alpha-(diphenylmethoxy)tropane analogs: potent dopamine uptake inhibitors without cocaine-like behavioral profiles. J Med Chem 37:2258-61 (1994)  
Target
Name:
Sodium-dependent dopamine transporter
Synonyms:
DA transporter SC6A3_RAT Sodium-dependent dopamine transporter | Sodium-dependent dopamine transporter (DAT)
Type:
Multi-pass membrane protein
Mol. Mass.:
68749.45
Organism:
Rattus norvegicus (rat)
Description:
P23977
Residue:
619
  
Inhibitor
Name:
BDBM86702
Synonyms:
3-[(4-Chloro-phenyl)-phenyl-methoxy]-8-methyl-8-aza-bicyclo[3.2.1]octane 4-ChloroBZT CHEMBL540034
Type:
Small organic molecule
Emp. Form.:
C21H24ClNO
Mol. Mass.:
341.874
SMILES:
CN1C2CCC1CC(C2)OC(c1ccccc1)c1ccc(Cl)cc1
: