Target
Muscarinic acetylcholine receptor M1
Ligand
BDBM50039188
Substrate
Meas. Tech.
ChEMBL_139846 (CHEMBL745744)
Ki
135±n/a nM
Citation
 Calderon, SNIzenwasser, SHeller, BGutkind, JSMattson, MVSu, TPNewman, AH Novel 1-phenylcycloalkanecarboxylic acid derivatives are potent and selective sigma 1 ligands. J Med Chem 37:2285-91 (1994)  
Target
Name:
Muscarinic acetylcholine receptor M1
Synonyms:
ACM1_HUMAN Cholinergic receptor, muscarinic 1 | Cholinergic, muscarinic M1
Type:
Protein
Mol. Mass.:
51442.54
Organism:
Homo sapiens (Human)
Description:
P11229
Residue:
460
  
Inhibitor
Name:
BDBM50039188
Synonyms:
1-Phenyl-cyclohexanecarboxylic acid 2-(2-diethylamino-ethoxy)-ethyl ester | CHEMBL74736
Type:
Small organic molecule
Emp. Form.:
C21H33NO3
Mol. Mass.:
347.4916
SMILES:
CCN(CC)CCOCCOC(=O)C1(CCCCC1)c1ccccc1
: