Target
Muscarinic acetylcholine receptor M2
Ligand
BDBM50039190
Substrate
Meas. Tech.
ChEMBL_140093 (CHEMBL752970)
Ki
844±n/a nM
Citation
 Calderon, SNIzenwasser, SHeller, BGutkind, JSMattson, MVSu, TPNewman, AH Novel 1-phenylcycloalkanecarboxylic acid derivatives are potent and selective sigma 1 ligands. J Med Chem 37:2285-91 (1994)  
Target
Name:
Muscarinic acetylcholine receptor M2
Synonyms:
ACM2_HUMAN Cholinergic, muscarinic M2 Muscarinic acetylcholine receptor M2 and M5 | RecName: Full=Muscarinic acetylcholine receptor M2
Type:
GPCR
Mol. Mass.:
51730.61
Organism:
Homo sapiens (Human)
Description:
P08172
Residue:
466
  
Inhibitor
Name:
BDBM50039190
Synonyms:
CHEMBL72506 | Diethyl-{2-[2-(1-phenyl-cyclopentylmethoxy)-ethoxy]-ethyl}-amine
Type:
Small organic molecule
Emp. Form.:
C20H33NO2
Mol. Mass.:
319.4815
SMILES:
CCN(CC)CCOCCOCC1(CCCC1)c1ccccc1
: