Target
Muscarinic acetylcholine receptor M1
Ligand
BDBM50039192
Substrate
Meas. Tech.
ChEMBL_139846 (CHEMBL745744)
Ki
1058±n/a nM
Citation
 Calderon, SNIzenwasser, SHeller, BGutkind, JSMattson, MVSu, TPNewman, AH Novel 1-phenylcycloalkanecarboxylic acid derivatives are potent and selective sigma 1 ligands. J Med Chem 37:2285-91 (1994)  
Target
Name:
Muscarinic acetylcholine receptor M1
Synonyms:
ACM1_HUMAN Cholinergic receptor, muscarinic 1 | Cholinergic, muscarinic M1
Type:
Protein
Mol. Mass.:
51442.54
Organism:
Homo sapiens (Human)
Description:
P11229
Residue:
460
  
Inhibitor
Name:
BDBM50039192
Synonyms:
1-(4-Methoxy-phenyl)-cyclopentanecarboxylic acid 2-(2-diethylamino-ethoxy)-ethyl ester | CHEMBL74305
Type:
Small organic molecule
Emp. Form.:
C21H33NO4
Mol. Mass.:
363.491
SMILES:
CCN(CC)CCOCCOC(=O)C1(CCCC1)c1ccc(OC)cc1
: