Target
Sigma non-opioid intracellular receptor 1
Ligand
BDBM50039193
Substrate
Meas. Tech.
ChEMBL_201099 (CHEMBL807414)
Ki
34±n/a nM
Citation
 Calderon, SNIzenwasser, SHeller, BGutkind, JSMattson, MVSu, TPNewman, AH Novel 1-phenylcycloalkanecarboxylic acid derivatives are potent and selective sigma 1 ligands. J Med Chem 37:2285-91 (1994)  
Target
Name:
Sigma non-opioid intracellular receptor 1
Synonyms:
Opioid receptor SGMR1_RAT Sigma non-opioid intracellular receptor 1 Sigma-1 | Sigmar1
Type:
Enzyme Catalytic Domain
Mol. Mass.:
25266.54
Organism:
RAT
Description:
Q9R0C9
Residue:
223
  
Inhibitor
Name:
BDBM50039193
Synonyms:
CHEMBL451542 | [2-(2-Diethylamino-ethoxy)-ethyl]-methyl-(1-phenyl-cyclopentylmethyl)-amine
Type:
Small organic molecule
Emp. Form.:
C21H36N2O
Mol. Mass.:
332.5233
SMILES:
CCN(CC)CCOCCN(C)CC1(CCCC1)c1ccccc1
: