Target
Muscarinic acetylcholine receptor M1
Ligand
BDBM50039195
Substrate
Meas. Tech.
ChEMBL_139846 (CHEMBL745744)
Ki
>10000±n/a nM
Citation
 Calderon, SNIzenwasser, SHeller, BGutkind, JSMattson, MVSu, TPNewman, AH Novel 1-phenylcycloalkanecarboxylic acid derivatives are potent and selective sigma 1 ligands. J Med Chem 37:2285-91 (1994)  
Target
Name:
Muscarinic acetylcholine receptor M1
Synonyms:
ACM1_HUMAN Cholinergic receptor, muscarinic 1 | Cholinergic, muscarinic M1
Type:
Protein
Mol. Mass.:
51442.54
Organism:
Homo sapiens (Human)
Description:
P11229
Residue:
460
  
Inhibitor
Name:
BDBM50039195
Synonyms:
2-Phenyl-propionic acid 2-(2-diethylamino-ethoxy)-ethyl ester | CHEMBL309172
Type:
Small organic molecule
Emp. Form.:
C17H27NO3
Mol. Mass.:
293.4012
SMILES:
CCN(CC)CCOCCOC(=O)C(C)c1ccccc1
: