Target
Sigma non-opioid intracellular receptor 1
Ligand
BDBM50039197
Substrate
Meas. Tech.
ChEMBL_201101 (CHEMBL807582)
Ki
44±n/a nM
Citation
 Calderon, SNIzenwasser, SHeller, BGutkind, JSMattson, MVSu, TPNewman, AH Novel 1-phenylcycloalkanecarboxylic acid derivatives are potent and selective sigma 1 ligands. J Med Chem 37:2285-91 (1994)  
Target
Name:
Sigma non-opioid intracellular receptor 1
Synonyms:
Opioid receptor SGMR1_RAT Sigma non-opioid intracellular receptor 1 Sigma-1 | Sigmar1
Type:
Enzyme Catalytic Domain
Mol. Mass.:
25266.54
Organism:
RAT
Description:
Q9R0C9
Residue:
223
  
Inhibitor
Name:
BDBM50039197
Synonyms:
1-Phenyl-cyclohexanecarboxylic acid 2-morpholin-4-yl-ethyl ester | CHEMBL305881
Type:
Small organic molecule
Emp. Form.:
C19H27NO3
Mol. Mass.:
317.4226
SMILES:
O=C(OCCN1CCOCC1)C1(CCCCC1)c1ccccc1
: