Target
Muscarinic acetylcholine receptor M2
Ligand
BDBM94507
Substrate
Meas. Tech.
ChEMBL_140093 (CHEMBL752970)
Ki
167±n/a nM
Citation
 Calderon, SNIzenwasser, SHeller, BGutkind, JSMattson, MVSu, TPNewman, AH Novel 1-phenylcycloalkanecarboxylic acid derivatives are potent and selective sigma 1 ligands. J Med Chem 37:2285-91 (1994)  
Target
Name:
Muscarinic acetylcholine receptor M2
Synonyms:
ACM2_HUMAN Cholinergic, muscarinic M2 Muscarinic acetylcholine receptor M2 and M5 | RecName: Full=Muscarinic acetylcholine receptor M2
Type:
GPCR
Mol. Mass.:
51730.61
Organism:
Homo sapiens (Human)
Description:
P08172
Residue:
466
  
Inhibitor
Name:
BDBM94507
Synonyms:
2-[2-(diethylamino)ethoxy]ethyl 1-phenylcyclopentane-1-carboxylate;2-hydroxypropane-1,2,3-tricarboxylic acid 2-hydroxypropane-1,2,3-tricarboxylic acid;1-phenyl-1-cyclopentanecarboxylic acid 2-[2-(diethylamino)ethoxy]ethyl ester CHEMBL73234 MLS002222257 cid_90010 | citric acid;1-phenylcyclopentanecarboxylic acid 2-[2-(diethylamino)ethoxy]ethyl ester
Type:
Small organic molecule
Emp. Form.:
C20H31NO3
Mol. Mass.:
333.465
SMILES:
CCN(CC)CCOCCOC(=O)C1(CCCC1)c1ccccc1
: