Target
Muscarinic acetylcholine receptor M2
Ligand
BDBM50039193
Substrate
Meas. Tech.
ChEMBL_140093 (CHEMBL752970)
Ki
1569±n/a nM
Citation
 Calderon, SNIzenwasser, SHeller, BGutkind, JSMattson, MVSu, TPNewman, AH Novel 1-phenylcycloalkanecarboxylic acid derivatives are potent and selective sigma 1 ligands. J Med Chem 37:2285-91 (1994)  
Target
Name:
Muscarinic acetylcholine receptor M2
Synonyms:
ACM2_HUMAN Cholinergic, muscarinic M2 Muscarinic acetylcholine receptor M2 and M5 | RecName: Full=Muscarinic acetylcholine receptor M2
Type:
GPCR
Mol. Mass.:
51730.61
Organism:
Homo sapiens (Human)
Description:
P08172
Residue:
466
  
Inhibitor
Name:
BDBM50039193
Synonyms:
CHEMBL451542 | [2-(2-Diethylamino-ethoxy)-ethyl]-methyl-(1-phenyl-cyclopentylmethyl)-amine
Type:
Small organic molecule
Emp. Form.:
C21H36N2O
Mol. Mass.:
332.5233
SMILES:
CCN(CC)CCOCCN(C)CC1(CCCC1)c1ccccc1
: