Target
Muscarinic acetylcholine receptor M2
Ligand
BDBM50039199
Substrate
Meas. Tech.
ChEMBL_140093 (CHEMBL752970)
Ki
1189±n/a nM
Citation
 Calderon, SNIzenwasser, SHeller, BGutkind, JSMattson, MVSu, TPNewman, AH Novel 1-phenylcycloalkanecarboxylic acid derivatives are potent and selective sigma 1 ligands. J Med Chem 37:2285-91 (1994)  
Target
Name:
Muscarinic acetylcholine receptor M2
Synonyms:
ACM2_HUMAN Cholinergic, muscarinic M2 Muscarinic acetylcholine receptor M2 and M5 | RecName: Full=Muscarinic acetylcholine receptor M2
Type:
GPCR
Mol. Mass.:
51730.61
Organism:
Homo sapiens (Human)
Description:
P08172
Residue:
466
  
Inhibitor
Name:
BDBM50039199
Synonyms:
1-(3,4-Dichloro-phenyl)-cyclohexanecarboxylic acid 2-morpholin-4-yl-ethoxymethyl ester | CHEMBL307628
Type:
Small organic molecule
Emp. Form.:
C20H27Cl2NO4
Mol. Mass.:
416.339
SMILES:
Clc1ccc(cc1Cl)C1(CCCCC1)C(=O)OCOCCN1CCOCC1
: