Target
Sigma non-opioid intracellular receptor 1
Ligand
BDBM50039184
Substrate
Meas. Tech.
ChEMBL_201099 (CHEMBL807414)
Ki
884±n/a nM
Citation
 Calderon, SNIzenwasser, SHeller, BGutkind, JSMattson, MVSu, TPNewman, AH Novel 1-phenylcycloalkanecarboxylic acid derivatives are potent and selective sigma 1 ligands. J Med Chem 37:2285-91 (1994)  
Target
Name:
Sigma non-opioid intracellular receptor 1
Synonyms:
Opioid receptor SGMR1_RAT Sigma non-opioid intracellular receptor 1 Sigma-1 | Sigmar1
Type:
Enzyme Catalytic Domain
Mol. Mass.:
25266.54
Organism:
RAT
Description:
Q9R0C9
Residue:
223
  
Inhibitor
Name:
BDBM50039184
Synonyms:
CHEMBL308707 | Diethyl-(2-{2-[(1-phenyl-cyclopentylmethyl)-amino]-ethoxy}-ethyl)-amine
Type:
Small organic molecule
Emp. Form.:
C20H34N2O
Mol. Mass.:
318.4968
SMILES:
CCN(CC)CCOCCNCC1(CCCC1)c1ccccc1
: