Target
Sigma non-opioid intracellular receptor 1
Ligand
BDBM50039198
Substrate
Meas. Tech.
ChEMBL_201099 (CHEMBL807414)
Ki
32±n/a nM
Citation
 Calderon, SNIzenwasser, SHeller, BGutkind, JSMattson, MVSu, TPNewman, AH Novel 1-phenylcycloalkanecarboxylic acid derivatives are potent and selective sigma 1 ligands. J Med Chem 37:2285-91 (1994)  
Target
Name:
Sigma non-opioid intracellular receptor 1
Synonyms:
Opioid receptor SGMR1_RAT Sigma non-opioid intracellular receptor 1 Sigma-1 | Sigmar1
Type:
Enzyme Catalytic Domain
Mol. Mass.:
25266.54
Organism:
RAT
Description:
Q9R0C9
Residue:
223
  
Inhibitor
Name:
BDBM50039198
Synonyms:
1-(3,4-Dichloro-phenyl)-cyclohexanecarboxylic acid (2-morpholin-4-yl-ethoxymethyl)-amide | CHEMBL307668
Type:
Small organic molecule
Emp. Form.:
C20H28Cl2N2O3
Mol. Mass.:
415.354
SMILES:
Clc1ccc(cc1Cl)C1(CCCCC1)C(=O)NCOCCN1CCOCC1
: