Target
Muscarinic acetylcholine receptor M1
Ligand
BDBM50039191
Substrate
Meas. Tech.
ChEMBL_139846 (CHEMBL745744)
Ki
581±n/a nM
Citation
 Calderon, SNIzenwasser, SHeller, BGutkind, JSMattson, MVSu, TPNewman, AH Novel 1-phenylcycloalkanecarboxylic acid derivatives are potent and selective sigma 1 ligands. J Med Chem 37:2285-91 (1994)  
Target
Name:
Muscarinic acetylcholine receptor M1
Synonyms:
ACM1_HUMAN Cholinergic receptor, muscarinic 1 | Cholinergic, muscarinic M1
Type:
Protein
Mol. Mass.:
51442.54
Organism:
Homo sapiens (Human)
Description:
P11229
Residue:
460
  
Inhibitor
Name:
BDBM50039191
Synonyms:
1-(3,4-Dichloro-phenyl)-cyclohexanecarboxylic acid (2-diethylamino-ethoxymethyl)-amide | CHEMBL73501
Type:
Small organic molecule
Emp. Form.:
C20H30Cl2N2O2
Mol. Mass.:
401.37
SMILES:
CCN(CC)CCOCNC(=O)C1(CCCCC1)c1ccc(Cl)c(Cl)c1
: