Target
Muscarinic acetylcholine receptor M1
Ligand
BDBM50039198
Substrate
Meas. Tech.
ChEMBL_139846 (CHEMBL745744)
Ki
>10000±n/a nM
Citation
 Calderon, SNIzenwasser, SHeller, BGutkind, JSMattson, MVSu, TPNewman, AH Novel 1-phenylcycloalkanecarboxylic acid derivatives are potent and selective sigma 1 ligands. J Med Chem 37:2285-91 (1994)  
Target
Name:
Muscarinic acetylcholine receptor M1
Synonyms:
ACM1_HUMAN Cholinergic receptor, muscarinic 1 | Cholinergic, muscarinic M1
Type:
Protein
Mol. Mass.:
51442.54
Organism:
Homo sapiens (Human)
Description:
P11229
Residue:
460
  
Inhibitor
Name:
BDBM50039198
Synonyms:
1-(3,4-Dichloro-phenyl)-cyclohexanecarboxylic acid (2-morpholin-4-yl-ethoxymethyl)-amide | CHEMBL307668
Type:
Small organic molecule
Emp. Form.:
C20H28Cl2N2O3
Mol. Mass.:
415.354
SMILES:
Clc1ccc(cc1Cl)C1(CCCCC1)C(=O)NCOCCN1CCOCC1
: