Target
Muscarinic acetylcholine receptor M2
Ligand
BDBM50039195
Substrate
Meas. Tech.
ChEMBL_140093 (CHEMBL752970)
Ki
>10000±n/a nM
Citation
 Calderon, SNIzenwasser, SHeller, BGutkind, JSMattson, MVSu, TPNewman, AH Novel 1-phenylcycloalkanecarboxylic acid derivatives are potent and selective sigma 1 ligands. J Med Chem 37:2285-91 (1994)  
Target
Name:
Muscarinic acetylcholine receptor M2
Synonyms:
ACM2_HUMAN Cholinergic, muscarinic M2 Muscarinic acetylcholine receptor M2 and M5 | RecName: Full=Muscarinic acetylcholine receptor M2
Type:
GPCR
Mol. Mass.:
51730.61
Organism:
Homo sapiens (Human)
Description:
P08172
Residue:
466
  
Inhibitor
Name:
BDBM50039195
Synonyms:
2-Phenyl-propionic acid 2-(2-diethylamino-ethoxy)-ethyl ester | CHEMBL309172
Type:
Small organic molecule
Emp. Form.:
C17H27NO3
Mol. Mass.:
293.4012
SMILES:
CCN(CC)CCOCCOC(=O)C(C)c1ccccc1
: