Target
Sigma non-opioid intracellular receptor 1
Ligand
BDBM50039196
Substrate
Meas. Tech.
ChEMBL_201099 (CHEMBL807414)
Ki
24±n/a nM
Citation
 Calderon, SNIzenwasser, SHeller, BGutkind, JSMattson, MVSu, TPNewman, AH Novel 1-phenylcycloalkanecarboxylic acid derivatives are potent and selective sigma 1 ligands. J Med Chem 37:2285-91 (1994)  
Target
Name:
Sigma non-opioid intracellular receptor 1
Synonyms:
Opioid receptor SGMR1_RAT Sigma non-opioid intracellular receptor 1 Sigma-1 | Sigmar1
Type:
Enzyme Catalytic Domain
Mol. Mass.:
25266.54
Organism:
RAT
Description:
Q9R0C9
Residue:
223
  
Inhibitor
Name:
BDBM50039196
Synonyms:
1-(4-Chloro-phenyl)-cyclopentanecarboxylic acid 2-(2-diethylamino-ethoxy)-ethyl ester | CHEMBL72219
Type:
Small organic molecule
Emp. Form.:
C20H30ClNO3
Mol. Mass.:
367.91
SMILES:
CCN(CC)CCOCCOC(=O)C1(CCCC1)c1ccc(Cl)cc1
: