Target
3-oxo-5-alpha-steroid 4-dehydrogenase 1
Ligand
BDBM50039282
Substrate
Meas. Tech.
ChEMBL_205220 (CHEMBL816494)
Ki
280±n/a nM
Citation
 Frye, SVHaffner, CDMaloney, PRMook, RADorsey, GFHiner, RNCribbs, CMWheeler, TNRay, JAAndrews, RC 6-Azasteroids: structure-activity relationships for inhibition of type 1 and 2 human 5 alpha-reductase and human adrenal 3 beta-hydroxy-delta 5-steroid dehydrogenase/3-keto-delta 5-steroid isomerase. J Med Chem 37:2352-60 (1994)  
Target
Name:
3-oxo-5-alpha-steroid 4-dehydrogenase 1
Synonyms:
3-oxo-5-alpha-steroid 4-dehydrogenase 1 S5A1_HUMAN SR type 1 Steroid 5-alpha-reductase | Steroid 5-alpha-reductase 1
Type:
Enzyme
Mol. Mass.:
29472.80
Organism:
Homo sapiens (Human)
Description:
P18405
Residue:
259
  
Inhibitor
Name:
BDBM50039282
Synonyms:
(1S,9aR,11aS)-9a,11a-Dimethyl-1-(2,4,6-triisopropyl-benzoyl)-1,2,3,3a,3b,4,5,8,9,9a,9b,10,11,11a-tetradecahydro-cyclopenta[i]phenanthridin-7-one | CHEMBL77124
Type:
Small organic molecule
Emp. Form.:
C34H49NO2
Mol. Mass.:
503.7584
SMILES:
CC(C)c1cc(C(C)C)c(C(=O)[C@H]2CCC3C4CN=C5CC(=O)CC[C@]5(C)C4CC[C@]23C)c(c1)C(C)C
: