Target
3-oxo-5-alpha-steroid 4-dehydrogenase 1
Ligand
BDBM50039320
Substrate
Meas. Tech.
ChEMBL_205220 (CHEMBL816494)
Ki
5±n/a nM
Citation
 Frye, SVHaffner, CDMaloney, PRMook, RADorsey, GFHiner, RNCribbs, CMWheeler, TNRay, JAAndrews, RC 6-Azasteroids: structure-activity relationships for inhibition of type 1 and 2 human 5 alpha-reductase and human adrenal 3 beta-hydroxy-delta 5-steroid dehydrogenase/3-keto-delta 5-steroid isomerase. J Med Chem 37:2352-60 (1994)  
Target
Name:
3-oxo-5-alpha-steroid 4-dehydrogenase 1
Synonyms:
3-oxo-5-alpha-steroid 4-dehydrogenase 1 S5A1_HUMAN SR type 1 Steroid 5-alpha-reductase | Steroid 5-alpha-reductase 1
Type:
Enzyme
Mol. Mass.:
29472.80
Organism:
Homo sapiens (Human)
Description:
P18405
Residue:
259
  
Inhibitor
Name:
BDBM50039320
Synonyms:
(4aR,6aS,7S)-1,4a,6a-Trimethyl-2-oxo-hexadecahydro-indeno[5,4-f]quinoline-7-carboxylic acid diethylamide | CHEMBL283981
Type:
Small organic molecule
Emp. Form.:
C24H40N2O2
Mol. Mass.:
388.5866
SMILES:
CCN(CC)C(=O)[C@H]1CCC2C3CCC4N(C)C(=O)CC[C@]4(C)C3CC[C@]12C
: