Target
Adenosine receptor A1
Ligand
BDBM50453444
Substrate
Meas. Tech.
ChEMBL_29642 (CHEMBL639749)
Ki
64±n/a nM
Citation
 Kim, HOJi, XDSiddiqi, SMOlah, MEStiles, GLJacobson, KA 2-Substitution of N6-benzyladenosine-5'-uronamides enhances selectivity for A3 adenosine receptors. J Med Chem 37:3614-21 (1994)  
Target
Name:
Adenosine receptor A1
Synonyms:
AA1R_RAT ADENOSINE A1 high Adenosine A1 receptor (A1) Adenosine receptors A1 | Adora1
Type:
Protein
Mol. Mass.:
36704.13
Organism:
Rattus norvegicus (rat)
Description:
Residue:
326
  
Inhibitor
Name:
BDBM50453444
Synonyms:
CHEMBL2113561
Type:
Small organic molecule
Emp. Form.:
C17H19IN6O4
Mol. Mass.:
498.275
SMILES:
Nc1nc(NCc2cccc(I)c2)c2ncn([C@@H]3O[C@H](CO)[C@@H](O)[C@H]3O)c2n1
: