Target
Gamma-aminobutyric acid receptor subunit alpha-3/beta-2/gamma-2
Ligand
BDBM50001478
Substrate
Meas. Tech.
ChEMBL_217287 (CHEMBL823756)
Ki
5±n/a nM
Citation
 Wieland, HALüddens, H Four amino acid exchanges convert a diazepam-insensitive, inverse agonist-preferring GABAA receptor into a diazepam-preferring GABAA receptor. J Med Chem 37:4576-80 (1995)  
Target
Name:
Gamma-aminobutyric acid receptor subunit alpha-3/beta-2/gamma-2
Synonyms:
GABA A receptor alpha-3/beta-2/gamma-2 | GABA receptor alpha-3/beta-2/gamma-2 subunit
Type:
Mol. Mass.:
Description:
ASSAY_ID of EBI is 68412
Components:
This complex has 3 components.
Component 1
Name:
Gamma-aminobutyric acid receptor subunit beta-2
Synonyms:
GBRB2_RAT Gabrb2 | Gamma-aminobutyric acid receptor subunit beta-2 (GABA(A) beta-2)
Type:
Enzyme
Mol. Mass.:
54648.97
Organism:
Rattus norvegicus (Rat)
Description:
P63138
Residue:
474
  
Component 2
Name:
Gamma-aminobutyric acid receptor subunit gamma-2
Synonyms:
GBRG2_RAT Gamma-aminobutyric acid receptor subunit gamma-2 (GABA(A) gamma-2)
Type:
Enzyme
Mol. Mass.:
54087.63
Organism:
Rattus norvegicus (Rat)
Description:
P18508
Residue:
466
  
Component 3
Name:
Gamma-aminobutyric acid receptor subunit alpha-3
Synonyms:
GABA A anti-Alpha3 GABA receptor alpha-3 subunit Gabra-3 Gamma-aminobutyric acid receptor subunit alpha-3
Type:
Enzyme Catalytic Domain
Mol. Mass.:
55444.88
Organism:
RAT
Description:
GABA A Alpha3Beta2Gamma2 0 RAT::P20236
Residue:
493
  
Inhibitor
Name:
BDBM50001478
Synonyms:
9H-beta-Carboline-3-carboxylic acid methyl ester 9H-beta-Carboline-3-carboxylic acid methyl ester (beta-CCM) CHEMBL268191
Type:
Small organic molecule
Emp. Form.:
C13H10N2O2
Mol. Mass.:
226.2307
SMILES:
COC(=O)c1cc2c(c[nH]1)nc1ccccc21
: