Target
Aldo-keto reductase family 1 member B1
Ligand
BDBM50040779
Substrate
Meas. Tech.
ChEMBL_32090 (CHEMBL643666)
IC50
850±n/a nM
Citation
 Lee, YSPearlstein, RKador, PF Molecular modeling studies of aldose reductase inhibitors. J Med Chem 37:787-92 (1994)  
Target
Name:
Aldo-keto reductase family 1 member B1
Synonyms:
ALDR_RAT Akr1b4 Aldr1
Type:
PROTEIN
Mol. Mass.:
35797.87
Organism:
Rattus norvegicus
Description:
ChEMBL_1512484
Residue:
316
  
Inhibitor
Name:
BDBM50040779
Synonyms:
(2-Fluoro-9H-fluoren-9-yl)-acetic acid | CHEMBL349910
Type:
Small organic molecule
Emp. Form.:
C15H11FO2
Mol. Mass.:
242.245
SMILES:
OC(=O)CC1c2ccccc2-c2ccc(F)cc12
: