Target
Aldo-keto reductase family 1 member B1
Ligand
BDBM50040780
Substrate
Meas. Tech.
ChEMBL_32090 (CHEMBL643666)
IC50
3500±n/a nM
Citation
 Lee, YSPearlstein, RKador, PF Molecular modeling studies of aldose reductase inhibitors. J Med Chem 37:787-92 (1994)  
Target
Name:
Aldo-keto reductase family 1 member B1
Synonyms:
ALDR_RAT Akr1b4 Aldr1
Type:
PROTEIN
Mol. Mass.:
35797.87
Organism:
Rattus norvegicus
Description:
ChEMBL_1512484
Residue:
316
  
Inhibitor
Name:
BDBM50040780
Synonyms:
CHEMBL163958 spiro[9H-fluorene-9,4'-(tetrahydro-1'H-imidazole)]-2',5'-dione
Type:
Small organic molecule
Emp. Form.:
C15H10N2O2
Mol. Mass.:
250.2521
SMILES:
O=C1NC(=O)C2(N1)c1ccccc1-c1ccccc21
: