Target
Aldo-keto reductase family 1 member B1
Ligand
BDBM50040782
Substrate
Meas. Tech.
ChEMBL_32090 (CHEMBL643666)
IC50
130±n/a nM
Citation
 Lee, YSPearlstein, RKador, PF Molecular modeling studies of aldose reductase inhibitors. J Med Chem 37:787-92 (1994)  
Target
Name:
Aldo-keto reductase family 1 member B1
Synonyms:
ALDR_RAT Akr1b4 Aldr1
Type:
PROTEIN
Mol. Mass.:
35797.87
Organism:
Rattus norvegicus
Description:
ChEMBL_1512484
Residue:
316
  
Inhibitor
Name:
BDBM50040782
Synonyms:
(2,8-Diisopropyl-3-thioxo-2,3-dihydro-benzo[1,4]oxazin-4-yl)-acetic acid | CHEMBL164603
Type:
Small organic molecule
Emp. Form.:
C16H21NO3S
Mol. Mass.:
307.408
SMILES:
CC(C)C1Oc2c(cccc2N(CC(O)=O)C1=S)C(C)C
: