Target
Gag-Pol polyprotein [489-587]
Ligand
BDBM197
Substrate
Meas. Tech.
ChEMBL_157567 (CHEMBL763318)
Ki
0.150000±n/a nM
Citation
 Greer, JErickson, JWBaldwin, JJVarney, MD Application of the three-dimensional structures of protein target molecules in structure-based drug design. J Med Chem 37:1035-54 (1994)  
Target
Name:
Gag-Pol polyprotein [489-587]
Synonyms:
Human immunodeficiency virus type 1 protease Pol polyprotein | gag-pol
Type:
Enzyme Subunit
Mol. Mass.:
10781.16
Organism:
Human immunodeficiency virus type 1
Description:
P04585[489-587]
Residue:
99
  
Inhibitor
Name:
BDBM197
Synonyms:
(2S)-N-[(2S,3R,4R,5S)-3,4-dihydroxy-5-[(2S)-3-methyl-2-{[methyl(pyridin-2-ylmethyl)carbamoyl]amino}butanamido]-1,6-diphenylhexan-2-yl]-3-methyl-2-{[methyl(pyridin-2-ylmethyl)carbamoyl]amino}butanamide CHEMBL43294
Type:
Emp. Form.:
C44H58N8O6
Mol. Mass.:
794.9813
SMILES:
CC(C)[C@H](NC(=O)N(C)Cc1ccccn1)C(=O)N[C@@H](Cc1ccccc1)[C@@H](O)[C@H](O)[C@H](Cc1ccccc1)NC(=O)[C@@H](NC(=O)N(C)Cc1ccccn1)C(C)C
: