Target
Thymidylate synthase
Ligand
BDBM50005210
Substrate
Meas. Tech.
ChEMBL_209651 (CHEMBL811592)
Ki
2±n/a nM
Citation
 Greer, JErickson, JWBaldwin, JJVarney, MD Application of the three-dimensional structures of protein target molecules in structure-based drug design. J Med Chem 37:1035-54 (1994)  
Target
Name:
Thymidylate synthase
Synonyms:
TS TYMS Thymidylate synthase (TS) | Thymidylate synthase/GAR transformylase/AICAR transformylase
Type:
Enzyme
Mol. Mass.:
35718.07
Organism:
Homo sapiens (Human)
Description:
Residue:
313
  
Inhibitor
Name:
BDBM50005210
Synonyms:
(2-Imino-1-methyl-1,2-dihydro-benzo[cd]indol-6-yl)-methyl-[4-(morpholine-4-sulfonyl)-benzyl]-amine; 0.5C6H6 CHEMBL9440 | N*6*-Methyl-N*6*-[4-(morpholine-4-sulfonyl)-benzyl]-benzo[cd]indole-2,6-diamine
Type:
Small organic molecule
Emp. Form.:
C23H24N4O3S
Mol. Mass.:
436.527
SMILES:
CN(Cc1ccc(cc1)S(=O)(=O)N1CCOCC1)c1ccc2N=C(N)c3cccc1c23
: