Target
Carbonic anhydrase 2
Ligand
BDBM50041048
Substrate
Meas. Tech.
ChEMBL_45062 (CHEMBL658729)
Ki
1±n/a nM
Citation
 Greer, JErickson, JWBaldwin, JJVarney, MD Application of the three-dimensional structures of protein target molecules in structure-based drug design. J Med Chem 37:1035-54 (1994)  
Target
Name:
Carbonic anhydrase 2
Synonyms:
CA-II CAC Carbonate dehydratase II Carbonic anhydrase 2 (CA-II) Carbonic anhydrase C Carbonic anhydrase II (CA-II) Carbonic anhydrase II (hCA II) | Carbonic anhydrase isoenzyme II (hCA II)
Type:
Enzyme
Mol. Mass.:
29250.71
Organism:
Homo sapiens (Human)
Description:
P00918
Residue:
260
  
Inhibitor
Name:
BDBM50041048
Synonyms:
(4S,6R)-6-Ethyl-4-ethylamino-7,7-dioxo-4,5,6,7-tetrahydro-7lambda*6*-thieno[2,3-b]thiopyran-2-sulfonic acid amide | CHEMBL9660
Type:
Small organic molecule
Emp. Form.:
C11H18N2O4S3
Mol. Mass.:
338.467
SMILES:
CCN[C@H]1C[C@@H](CC)S(=O)(=O)c2sc(cc12)S(N)(=O)=O
: