Target
Endothelin-converting enzyme 1
Ligand
BDBM50035246
Substrate
Meas. Tech.
ChEMBL_64355 (CHEMBL679843)
IC50
0.25±n/a nM
Citation
 Bihovsky, RLevinson, BLLoewi, RCErhardt, PWPolokoff, MA Hydroxamic acids as potent inhibitors of endothelin-converting enzyme from human bronchiolar smooth muscle. J Med Chem 38:2119-29 (1995)  
Target
Name:
Endothelin-converting enzyme 1
Synonyms:
ECE-1 ECE1_HUMAN Endothelin-converting enzyme 1 (ECE1)
Type:
Enzyme
Mol. Mass.:
87155.11
Organism:
Homo sapiens (Human)
Description:
P42892
Residue:
770
  
Inhibitor
Name:
BDBM50035246
Synonyms:
2-(2-Hydroxycarbamoyl-4-methyl-pentanoylamino)-3-(1H-indol-3-yl)-propionic acid | CHEMBL303159
Type:
Small organic molecule
Emp. Form.:
C18H23N3O5
Mol. Mass.:
361.3923
SMILES:
CC(C)CC(C(=O)NO)C(=O)NC(Cc1c[nH]c2ccccc12)C(O)=O
: