Target
3-oxo-5-alpha-steroid 4-dehydrogenase 1
Ligand
BDBM50031880
Substrate
Meas. Tech.
ChEMBL_204883 (CHEMBL808554)
Ki
8±n/a nM
Citation
 Frye, SVHaffner, CDMaloney, PRHiner, RNDorsey, GFNoe, RAUnwalla, RJBatchelor, KWBramson, HNStuart, JD Structure-activity relationships for inhibition of type 1 and 2 human 5 alpha-reductase and human adrenal 3 beta-hydroxy-delta 5-steroid dehydrogenase/3-keto-delta 5-steroid isomerase by 6-azaandrost-4-en-3-ones: optimization of the C17 substituent. J Med Chem 38:2621-7 (1995)  
Target
Name:
3-oxo-5-alpha-steroid 4-dehydrogenase 1
Synonyms:
3-oxo-5-alpha-steroid 4-dehydrogenase 1 S5A1_HUMAN SR type 1 Steroid 5-alpha-reductase | Steroid 5-alpha-reductase 1
Type:
Enzyme
Mol. Mass.:
29472.80
Organism:
Homo sapiens (Human)
Description:
P18405
Residue:
259
  
Inhibitor
Name:
BDBM50031880
Synonyms:
(1S,9aR,11aS)-9a,11a-Dimethyl-7-oxo-2,3,3a,3b,4,5,7,8,9,9a,9b,10,11,11a-tetradecahydro-1H-cyclopenta[i]phenanthridine-1-carboxylic acid (3,5-di-tert-butyl-phenyl)-amide | CHEMBL25516
Type:
Small organic molecule
Emp. Form.:
C33H48N2O2
Mol. Mass.:
504.7464
SMILES:
CC(C)(C)c1cc(NC(=O)[C@H]2CCC3C4CN=C5CC(=O)CC[C@]5(C)C4CC[C@]23C)cc(c1)C(C)(C)C
: